BDBM88635 2-[(2,4-dichlorobenzoyl)amino]acetic acid [2-keto-2-(N-methylanilino)ethyl] ester::2-[[(2,4-dichlorophenyl)-oxomethyl]amino]acetic acid [2-(N-methylanilino)-2-oxoethyl] ester::MLS001004438::SMR000348067::[2-(N-methylanilino)-2-oxoethyl] 2-[(2,4-dichlorobenzoyl)amino]acetate::[2-[methyl(phenyl)amino]-2-oxidanylidene-ethyl] 2-[(2,4-dichlorophenyl)carbonylamino]ethanoate::cid_2492526
SMILES CN(C(=O)COC(=O)CNC(=O)c1ccc(Cl)cc1Cl)c1ccccc1
InChI Key InChIKey=AJDUDPWRLIMVAH-UHFFFAOYSA-N
Data  1 IC50
  Tab Delimited (TSV)   2D SDfile   Computed 3D by Vconf -m prep SDfile
Find this compound or compounds like it in BindingDB:
Activity Spreadsheet -- Enzyme Inhibition Constant Data from BindingDB
Found 1 hit for monomerid = 88635
TargetMelanocortin receptor 4(Homo sapiens (Human))
The Scripps Research Institute Molecular Screening Center
Curated by PubChem BioAssay
LigandPNGBDBM88635(2-[(2,4-dichlorobenzoyl)amino]acetic acid [2-keto-...)
Affinity DataIC50: >6.46E+4nM. Assay description: Source (MLPCN Center Name): The Scripps Research Institute Molecular Screening Center (SRISMC) Center Affiliation: The Scripps Research Institute, TS...
In DepthDetails PCBioAssay