BDBM97102 4-(2-chloroethylamino)-N-(2-hydroxyethyl)-1,2,5-thiadiazole-3-carboxamide::MLS000678378::SMR000285005::cid_548479
SMILES OCCNC(=O)c1nsnc1NCCCl
InChI Key InChIKey=IFFHKZADUJHGLP-UHFFFAOYSA-N
Data  1 IC50
  Tab Delimited (TSV)   2D SDfile   Computed 3D by Vconf -m prep SDfile
Find this compound or compounds like it in BindingDB:
Activity Spreadsheet -- Enzyme Inhibition Constant Data from BindingDB
Found 1 hit for monomerid = 97102
TargetGalanin receptor type 3(Homo sapiens (Human))
The Scripps Research Institute Molecular Screening Center
Curated by PubChem BioAssay
LigandPNGBDBM97102(4-(2-chloroethylamino)-N-(2-hydroxyethyl)-1,2,5-th...)
Affinity DataIC50: >2.99E+4nM
In DepthDetails PCBioAssay