BDBM97131 2-isopropyl-8,9-dimethoxy-1,2,6,6a,12,12a-hexahydrochromeno[3,4-b]furo[2,3-h]chromen-6-one::MLS000851173::SMR000457416::cid_243725
SMILES [H][C@@]12COc3cc(OC)c(OC)cc3[C@]1([H])C(=O)c1ccc3O[C@H](Cc3c1O2)C(C)C
InChI Key InChIKey=DTFARBHXORYQBF-HBGVWJBISA-N
Data  1 IC50
  Tab Delimited (TSV)   2D SDfile   Computed 3D by Vconf -m prep SDfile
Find this compound or compounds like it in BindingDB:
Activity Spreadsheet -- Enzyme Inhibition Constant Data from BindingDB
Found 1 hit for monomerid = 97131
TargetGalanin receptor type 3(Homo sapiens (Human))
The Scripps Research Institute Molecular Screening Center
Curated by PubChem BioAssay
LigandPNGBDBM97131(2-isopropyl-8,9-dimethoxy-1,2,6,6a,12,12a-hexahydr...)
Affinity DataIC50:  15.4nM
In DepthDetails PCBioAssay