BDBM97404 Orexin receptor antagonist 36::US20130102619, 36
SMILES C[C@@H]1CC[C@H](CN1C(=O)c1c(F)cccc1-c1ncccn1)Oc1cc(ccn1)C#N
InChI Key InChIKey=PFBVYJILAFCGTI-NVXWUHKLSA-N
Data  2 KI  2 IC50
  Tab Delimited (TSV)   2D SDfile   Computed 3D by Vconf -m prep SDfile
Find this compound or compounds like it in BindingDB:
Activity Spreadsheet -- Enzyme Inhibition Constant Data from BindingDB
Found 4 hits for monomerid = 97404
TargetOrexin receptor type 2(Homo sapiens (Human))
TBA
US Patent
LigandPNGBDBM97404(Orexin receptor antagonist 36 | US20130102619, 36)
Affinity DataKi:  2.10nM. Assay description: The inhibition constant (ki) is determined using a radioligand assay.
In DepthDetails US Patent
TargetOrexin/Hypocretin receptor type 1(Homo sapiens (Human))
TBA
US Patent
LigandPNGBDBM97404(Orexin receptor antagonist 36 | US20130102619, 36)
Affinity DataKi:  930nM. Assay description: The inhibition constant (ki) is determined using a radioligand assay.
In DepthDetails US Patent
TargetOrexin receptor type 2(Rattus norvegicus (Rat))
TBA
US Patent
LigandPNGBDBM97404(Orexin receptor antagonist 36 | US20130102619, 36)
Affinity DataIC50:  47nMT: 2°C. Assay description: FLIPR assay using orexin receptor.
In DepthDetails US Patent
TargetOrexin/Hypocretin receptor type 1(Rattus norvegicus (Rat))
TBA
US Patent
LigandPNGBDBM97404(Orexin receptor antagonist 36 | US20130102619, 36)
Affinity DataIC50: >1.00E+4nMT: 2°C. Assay description: FLIPR assay using orexin receptor.
In DepthDetails US Patent