BDBM97407 Orexin receptor antagonist 2::US20130102619, 2
SMILES C[C@@H]1CC[C@H](CN1C(=O)c1ccccc1-c1ncccn1)Oc1cc(ccn1)C#N
InChI Key InChIKey=MMRBNOXAAQLWLU-SJLPKXTDSA-N
Data  4 KI  6 IC50
  Tab Delimited (TSV)   2D SDfile   Computed 3D by Vconf -m prep SDfile
Find this compound or compounds like it in BindingDB:
Activity Spreadsheet -- Enzyme Inhibition Constant Data from BindingDB
Found 10 hits for monomerid = 97407
TargetOrexin receptor type 2(Homo sapiens (Human))
Merck
Curated by ChEMBL
LigandPNGBDBM97407(Orexin receptor antagonist 2 | US20130102619, 2)
Affinity DataKi:  1.30nM. Assay description: Displacement of [3H](S)-N-(2-(1H-pyrrol-1-yl)phenyl)-1-(2-(1-methyl-1H-benzo[d]imidazol-2-ylthio)acetyl)pyrrolidine-2-carboxamide from human OX2R exp...
In DepthDetails ArticlePubMed
TargetOrexin receptor type 2(Homo sapiens (Human))
Merck
Curated by ChEMBL
LigandPNGBDBM97407(Orexin receptor antagonist 2 | US20130102619, 2)
Affinity DataKi:  1.30nM. Assay description: The inhibition constant (ki) is determined using a radioligand assay.
In DepthDetails US Patent
TargetOrexin/Hypocretin receptor type 1(Homo sapiens (Human))
Merck
Curated by ChEMBL
LigandPNGBDBM97407(Orexin receptor antagonist 2 | US20130102619, 2)
Affinity DataKi:  569nM. Assay description: Displacement of [3H](S)-N-(biphenyl-2-yl)-1-(2-(1-methyl-1H-benzo[d]imidazol-2-ylthio)acetyl)pyrrolidine-2-carboxamide from human OX1R expressed in C...
In DepthDetails ArticlePubMed
TargetOrexin/Hypocretin receptor type 1(Homo sapiens (Human))
Merck
Curated by ChEMBL
LigandPNGBDBM97407(Orexin receptor antagonist 2 | US20130102619, 2)
Affinity DataKi:  761nM. Assay description: The inhibition constant (ki) is determined using a radioligand assay.
In DepthDetails US Patent
TargetOrexin receptor type 2(Homo sapiens (Human))
Merck
Curated by ChEMBL
LigandPNGBDBM97407(Orexin receptor antagonist 2 | US20130102619, 2)
Affinity DataIC50:  28nM. Assay description: Antagonist activity at human OX2R expressed in CHOK1 cells assessed as reduction in orexin A-induced calcium flux preincubated followed by orexin A a...
In DepthDetails ArticlePubMed
TargetOrexin/Hypocretin receptor type 1(Homo sapiens (Human))
Merck
Curated by ChEMBL
LigandPNGBDBM97407(Orexin receptor antagonist 2 | US20130102619, 2)
Affinity DataIC50:  4.90E+3nM. Assay description: Antagonist activity at human OX1R expressed in CHOK1 cells assessed as reduction in orexin A-induced calcium flux preincubated followed by orexin A a...
In DepthDetails ArticlePubMed
TargetOrexin receptor type 2(Homo sapiens (Human))
Merck
Curated by ChEMBL
LigandPNGBDBM97407(Orexin receptor antagonist 2 | US20130102619, 2)
Affinity DataIC50:  28nM. Assay description: Antagonist activity against human OX2R expressed in CHOK1 cells assessed as inhibition of orexin A-induced intercellular Ca2+ mobilization by FLIPR a...
In DepthDetails ArticlePubMed
TargetOrexin/Hypocretin receptor type 1(Rattus norvegicus (Rat))
TBA
US Patent
LigandPNGBDBM97407(Orexin receptor antagonist 2 | US20130102619, 2)
Affinity DataIC50:  4.87E+3nMT: 2°C. Assay description: FLIPR assay using orexin receptor.
In DepthDetails US Patent
TargetOrexin receptor type 2(Rattus norvegicus (Rat))
TBA
US Patent
LigandPNGBDBM97407(Orexin receptor antagonist 2 | US20130102619, 2)
Affinity DataIC50:  28nMT: 2°C. Assay description: FLIPR assay using orexin receptor.
In DepthDetails US Patent
TargetOrexin/Hypocretin receptor type 1(Homo sapiens (Human))
Merck
Curated by ChEMBL
LigandPNGBDBM97407(Orexin receptor antagonist 2 | US20130102619, 2)
Affinity DataIC50:  4.90E+3nM. Assay description: Antagonist activity against human OX1R expressed in CHOK1 cells assessed as inhibition of orexin A-induced intercellular Ca2+ mobilization by FLIPR a...
In DepthDetails ArticlePubMed