Target
Beta-2 adrenergic receptor
Ligand
BDBM86453
Substrate
Meas. Tech.
ChEMBL_756114 (CHEMBL1804370)
EC50
0.501187±n/a nM
Citation
 Stocks, MJAlcaraz, LBailey, ABonnert, RCadogan, EChristie, JConnolly, SCook, AFisher, AFlaherty, AHill, SHumphries, AIngall, AJordan, SLawson, MMullen, ANicholls, DPaine, SPairaudeau, GSt-Gallay, SYoung, A Design driven HtL: The discovery and synthesis of new high efficacyß2-agonists. Bioorg Med Chem Lett 21:4027-31 (2011)  
Target
Name:
Beta-2 adrenergic receptor
Synonyms:
ADRB2 ADRB2_HUMAN Beta-2 adrenoceptor | Beta-2 adrenoreceptor
Type:
Mol. Mass.:
46461.69
Organism:
Homo sapiens (Human)
Description:
P07550
Residue:
413
  
Inhibitor
Name:
BDBM86453
Synonyms:
CAS_73573-87-2 NSC_3083544
Type:
Small organic molecule
Emp. Form.:
C19H24N2O4
Mol. Mass.:
344.4049
SMILES:
COc1ccc(CC(C)NCC(O)c2ccc(O)c(NC=O)c2)cc1
: