BDBM50322979 CHEMBL1210209::N-(1-((2,6-diethoxy-4'-fluorobiphenyl-4-yl)methyl)piperidin-4-yl)-6-(methylamino)nicotinamide
SMILES CCOc1cc(CN2CCC(CC2)NC(=O)c2ccc(NC)nc2)cc(OCC)c1-c1ccc(F)cc1
InChI Key InChIKey=AKCGOXREZJOGPS-UHFFFAOYSA-N
Data  1 KI  1 EC50
  Tab Delimited (TSV)   2D SDfile   Computed 3D by Vconf -m prep SDfile
Find this compound or compounds like it in BindingDB:
Activity Spreadsheet -- Enzyme Inhibition Constant Data from BindingDB
Found 2 hits for monomerid = 50322979
TargetSomatostatin receptor type 5(Homo sapiens (Human))
F. Hoffmann-La Roche
Curated by ChEMBL
LigandPNGBDBM50322979(CHEMBL1210209 | N-(1-((2,6-diethoxy-4'-fluorobiphe...)
Affinity DataKi:  2.5nM. Assay description: Displacement of radio labeled 11 Tyr SST14 from human SST5 receptor expressed in CHO cells
In DepthDetails ArticlePubMed
TargetSomatostatin receptor type 5(Homo sapiens (Human))
F. Hoffmann-La Roche
Curated by ChEMBL
LigandPNGBDBM50322979(CHEMBL1210209 | N-(1-((2,6-diethoxy-4'-fluorobiphe...)
Affinity DataEC50: >1.00E+3nM. Assay description: Antagonist activity at human SST5 receptor expressed in CHO cells assessed as inhibition of forskolin-induced cAMP accumulation by FRET assay
In DepthDetails ArticlePubMed