BDBM50415770 CHEMBL1079516
SMILES CNC1CN(C1)c1nc(N)nc2c1CCCC21CCCC1
InChI Key InChIKey=FNLKLDDVROBECF-UHFFFAOYSA-N
Data  4 KI
  Tab Delimited (TSV)   2D SDfile   Computed 3D by Vconf -m prep SDfile
Find this compound or compounds like it in BindingDB:
Activity Spreadsheet -- Enzyme Inhibition Constant Data from BindingDB
Found 4 hits for monomerid = 50415770
TargetHistamine H4 receptor(Rattus norvegicus (rat))
Abbott Laboratories
Curated by ChEMBL
LigandPNGBDBM50415770(CHEMBL1079516)
Affinity DataKi:  1.45nM. Assay description: Displacement of [3H]-histamine from rat histamine H4 receptor after 1 hr by liquid scintillation counting
In DepthDetails ArticlePubMed
TargetHistamine H4 receptor(Homo sapiens (Human))
Abbott Laboratories
Curated by ChEMBL
LigandPNGBDBM50415770(CHEMBL1079516)
Affinity DataKi:  1.51nM. Assay description: Displacement of [3H]-histamine from human histamine H4 receptor expressed in HEK293 cells after 1 hr by liquid scintillation counting
In DepthDetails ArticlePubMed
TargetHistamine H3 receptor(Rattus norvegicus (rat))
Abbott Laboratories
Curated by ChEMBL
LigandPNGBDBM50415770(CHEMBL1079516)
Affinity DataKi:  6.76nM. Assay description: Displacement of [3H]NAMH from rat histamine H3 receptor expressed in C6 cells after 1 hr by liquid scintillation counting
In DepthDetails ArticlePubMed
TargetHistamine H3 receptor(Homo sapiens (Human))
Abbott Laboratories
Curated by ChEMBL
LigandPNGBDBM50415770(CHEMBL1079516)
Affinity DataKi:  63.1nM. Assay description: Displacement of [3H]NAMH from human histamine H3 receptor expressed in C6 cells after 1 hr by liquid scintillation counting
In DepthDetails ArticlePubMed