BDBM100011 (3-methyl-1-pyridin-2-yl-6-thiophen-2-yl-pyrazolo[3,4-b]pyridin-4-yl)-morpholin-4-yl-methanone::(3-methyl-1-pyridin-2-yl-6-thiophen-2-ylpyrazolo[3,4-b]pyridin-4-yl)-morpholin-4-ylmethanone::MLS000053976::SMR000063405::[3-methyl-1-(2-pyridinyl)-6-thiophen-2-yl-4-pyrazolo[3,4-b]pyridinyl]-(4-morpholinyl)methanone::[3-methyl-1-(2-pyridyl)-6-(2-thienyl)pyrazolo[3,4-b]pyridin-4-yl]-morpholino-methanone::cid_2999639
SMILES Cc1nn(-c2ccccn2)c2nc(cc(C(=O)N3CCOCC3)c12)-c1cccs1
InChI Key InChIKey=ZPISRUGNMFDTLG-UHFFFAOYSA-N
Data  1 EC50
  Tab Delimited (TSV)   2D SDfile   Computed 3D by Vconf -m prep SDfile
Find this compound or compounds like it in BindingDB:
Activity Spreadsheet -- Enzyme Inhibition Constant Data from BindingDB
Found 1 hit for monomerid = 100011
TargetKallikrein-7(Homo sapiens (Human))
The Scripps Research Institute Molecular Screening Center
Curated by PubChem BioAssay
LigandPNGBDBM100011((3-methyl-1-pyridin-2-yl-6-thiophen-2-yl-pyrazolo[...)
Affinity DataEC50: >6.95E+4nM
In DepthDetails PCBioAssay