BDBM10002 (6-Methoxybenzofuran-2-yl)-(4-methoxyphenyl)-3-pyridyl-methanol::(6-methoxy-1-benzofuran-2-yl)(4-methoxyphenyl)pyridin-3-ylmethanol::Benzofuran Pyridine Derivative 4c
SMILES COc1ccc(cc1)C(O)(c1cc2ccc(OC)cc2o1)c1cccnc1
InChI Key InChIKey=DNPOZLKMPCEZQH-UHFFFAOYSA-N
Data  2 IC50
  Tab Delimited (TSV)   2D SDfile   Computed 3D by Vconf -m prep SDfile
Find this compound or compounds like it in BindingDB:
Activity Spreadsheet -- Enzyme Inhibition Constant Data from BindingDB
Found 2 hits for monomerid = 10002
TargetAromatase(Homo sapiens (Human))
Novartis Institutes For Biomedical Research
Curated by ChEMBL
LigandPNGBDBM10002((6-Methoxybenzofuran-2-yl)-(4-methoxyphenyl)-3-pyr...)
Affinity DataIC50:  160nM. Assay description: Inhibition of aromatase
In DepthDetails ArticlePubMed
TargetAromatase(Homo sapiens (Human))
Novartis Institutes For Biomedical Research
Curated by ChEMBL
LigandPNGBDBM10002((6-Methoxybenzofuran-2-yl)-(4-methoxyphenyl)-3-pyr...)
Affinity DataIC50:  160nMpH: 7.4 T: 2°C. Assay description: The enzyme activity was assayed by measuring the 3H-labeled H2O formed from [1,2,6,7-3H ]androstenedione / androstenedione during aromatization. Afte...
In DepthDetails ArticlePubMed