BDBM10007 4-[(6-methoxy-1-benzofuran-2-yl)(1H-1,2,4-triazol-1-yl)methyl]benzonitrile::4-[6-Methoxybenzofuran-2-yl)-1H-1,2,4-triazol-1-ylmethyl]-benzonitrile::Benzofuran Triazole Derivative 7d
SMILES COc1ccc2cc(oc2c1)C(c1ccc(cc1)C#N)n1cncn1
InChI Key InChIKey=JBMZMMJSVSGYOU-UHFFFAOYSA-N
Data  2 IC50
  Tab Delimited (TSV)   2D SDfile   Computed 3D by Vconf -m prep SDfile
Find this compound or compounds like it in BindingDB:
Activity Spreadsheet -- Enzyme Inhibition Constant Data from BindingDB
Found 2 hits for monomerid = 10007
TargetAromatase(Homo sapiens (Human))
Cardiff University
Curated by ChEMBL
LigandPNGBDBM10007(4-[(6-methoxy-1-benzofuran-2-yl)(1H-1,2,4-triazol-...)
Affinity DataIC50:  0.110nM. Assay description: Inhibition of aromatase in human JEG-3 cells using Androst-4-ene-3,17-dione as substrate incubated for 1 hr and measured by BCA assay
In DepthDetails PubMed
TargetAromatase(Homo sapiens (Human))
Cardiff University
Curated by ChEMBL
LigandPNGBDBM10007(4-[(6-methoxy-1-benzofuran-2-yl)(1H-1,2,4-triazol-...)
Affinity DataIC50:  10nMpH: 7.4 T: 2°C. Assay description: The enzyme activity was assayed by measuring the 3H-labeled H2O formed from [1,2,6,7-3H ]androstenedione / androstenedione during aromatization. Afte...
In DepthDetails ArticlePubMed