BDBM10263 (1,3,4-Trioxo-1,2,3,4-tetrahydro-isoquinolin-5-yl)-carbamic acid benzyl ester::Isoquinoline-1,3,4-trione 6j::benzyl N-(1,3,4-trioxo-1,2,3,4-tetrahydroisoquinolin-5-yl)carbamate
SMILES O=C(Nc1cccc2C(=O)NC(=O)C(=O)c12)OCc1ccccc1
InChI Key InChIKey=YTPPVXLJEJWIHN-UHFFFAOYSA-N
Data  1 IC50
  Tab Delimited (TSV)   2D SDfile   Computed 3D by Vconf -m prep SDfile
Find this compound or compounds like it in BindingDB:
Activity Spreadsheet -- Enzyme Inhibition Constant Data from BindingDB
Found 1 hit for monomerid = 10263
TargetCaspase-3(Homo sapiens (Human))
Shanghai Institutes For Biological Sciences
LigandPNGBDBM10263((1,3,4-Trioxo-1,2,3,4-tetrahydro-isoquinolin-5-yl)...)
Affinity DataIC50:  763nM. Assay description: The rate of chromogenic substrate hydrolysis was monitored by the change of absorbance at 405 nm for 3 min. Compounds were tested in duplicate. The I...
In DepthDetails ArticlePubMed