BDBM10267 2-phenyl-N-(1,3,4-trioxo-1,2,3,4-tetrahydroisoquinolin-5-yl)acetamide::Isoquinoline-1,3,4-trione 6n::N-(1,2,3,4-Tetrahydro-1,3,4-trioxoisoquinolin-5-yl)-2-phenylacetamide
SMILES O=C(Cc1ccccc1)Nc1cccc2C(=O)NC(=O)C(=O)c12
InChI Key InChIKey=CAHWTZXTEVZQAL-UHFFFAOYSA-N
Data  1 IC50
  Tab Delimited (TSV)   2D SDfile   Computed 3D by Vconf -m prep SDfile
Find this compound or compounds like it in BindingDB:
Activity Spreadsheet -- Enzyme Inhibition Constant Data from BindingDB
Found 1 hit for monomerid = 10267
TargetCaspase-3(Homo sapiens (Human))
Shanghai Institutes For Biological Sciences
LigandPNGBDBM10267(2-phenyl-N-(1,3,4-trioxo-1,2,3,4-tetrahydroisoquin...)
Affinity DataIC50:  139nM. Assay description: The rate of chromogenic substrate hydrolysis was monitored by the change of absorbance at 405 nm for 3 min. Compounds were tested in duplicate. The I...
In DepthDetails ArticlePubMed