BDBM1028 Hydroxyethylene dipeptide isostere 11::tert-butyl N-[(2S,3S,5R)-5-{[(1S)-1-{[(1S)-1-carbamoyl-2-phenylethyl]carbamoyl}-3-methylbutyl]carbamoyl}-3-hydroxy-1-phenyl-5-(3-phenylpropyl)pentan-2-yl]carbamate
SMILES CC(C)C[C@H](NC(=O)[C@H](CCCc1ccccc1)C[C@H](O)[C@H](Cc1ccccc1)NC(=O)OC(C)(C)C)C(=O)N[C@@H](Cc1ccccc1)C(N)=O
InChI Key InChIKey=ZFZABTBOHOLXDC-WIZSLEGPSA-N
Data  1 IC50
  Tab Delimited (TSV)   2D SDfile   Computed 3D by Vconf -m prep SDfile
Find this compound or compounds like it in BindingDB:
Activity Spreadsheet -- Enzyme Inhibition Constant Data from BindingDB
Found 1 hit for monomerid = 1028
TargetDimer of Gag-Pol polyprotein [489-587](Human immunodeficiency virus type 1)
Merck Research Laboratories
LigandPNGBDBM1028(Hydroxyethylene dipeptide isostere 11 | tert-butyl...)
Affinity DataIC50:  0.360nMpH: 5.5 T: 2°C. Assay description: Assay of HIV protease inhibition was performed by peptide cleavage using the substrate Val-Ser-Gln-Asn-beta-naphthylalanine*Pro-Ile-Val. Products of ...
In DepthDetails ArticlePubMed