BDBM10283 Isoquinoline-1,3,4-trione 13b::N-(prop-2-en-1-yl)-N'-(1,3,4-trioxo-1,2,3,4-tetrahydroisoquinolin-6-yl)butanediamide::N-Allyl-N-(1,3,4-trioxo-1,2,3,4-tetrahydro-isoquinolin-6-yl)-succinamide
SMILES C=CCNC(=O)CCC(=O)Nc1ccc2C(=O)NC(=O)C(=O)c2c1
InChI Key InChIKey=JNECYTIVOBXLPC-UHFFFAOYSA-N
Data  1 IC50
  Tab Delimited (TSV)   2D SDfile   Computed 3D by Vconf -m prep SDfile
Find this compound or compounds like it in BindingDB:
Activity Spreadsheet -- Enzyme Inhibition Constant Data from BindingDB
Found 1 hit for monomerid = 10283
TargetCaspase-3(Homo sapiens (Human))
Shanghai Institutes For Biological Sciences
LigandPNGBDBM10283(Isoquinoline-1,3,4-trione 13b | N-(prop-2-en-1-yl)...)
Affinity DataIC50:  44nM. Assay description: The rate of chromogenic substrate hydrolysis was monitored by the change of absorbance at 405 nm for 3 min. Compounds were tested in duplicate. The I...
In DepthDetails ArticlePubMed