BDBM10294 2-methoxy-N-(1,3,4-trioxo-1,2,3,4-tetrahydroisoquinolin-7-yl)benzamide::Isoquinoline-1,3,4-trione 14b::N-(1,2,3,4-Tetrahydro-1,3,4-trioxoisoquinolin-7-yl)-2-methoxybenzamide
SMILES COc1ccccc1C(=O)Nc1ccc2C(=O)C(=O)NC(=O)c2c1
InChI Key InChIKey=VXBMCARIOUOJCM-UHFFFAOYSA-N
Data  1 IC50
  Tab Delimited (TSV)   2D SDfile   Computed 3D by Vconf -m prep SDfile
Find this compound or compounds like it in BindingDB:
Activity Spreadsheet -- Enzyme Inhibition Constant Data from BindingDB
Found 1 hit for monomerid = 10294
TargetCaspase-3(Homo sapiens (Human))
Shanghai Institutes For Biological Sciences
LigandPNGBDBM10294(2-methoxy-N-(1,3,4-trioxo-1,2,3,4-tetrahydroisoqui...)
Affinity DataIC50:  437nM. Assay description: The rate of chromogenic substrate hydrolysis was monitored by the change of absorbance at 405 nm for 3 min. Compounds were tested in duplicate. The I...
In DepthDetails ArticlePubMed