BDBM103772 US8551978, I-42::US8816088, I-42::US9394275, I-42::US9572802, Compound I-42::US9682957, I-42
SMILES C[C@H](Cc1ccc(NC(=O)c2cccc(c2)N(C)C(=O)CCN2CCC(CC2)OC(=O)Nc2ccccc2-c2ccccc2)cc1)NC[C@H](O)c1ccc(O)c2[nH]c(=O)ccc12
InChI Key InChIKey=WMOXZAIHKSUWOG-VNIMEATCSA-N
Data  5 KI  2 EC50
  Tab Delimited (TSV)   2D SDfile   Computed 3D by Vconf -m prep SDfile
Find this compound or compounds like it in BindingDB:
Activity Spreadsheet -- Enzyme Inhibition Constant Data from BindingDB
Found 7 hits for monomerid = 103772
TargetMuscarinic acetylcholine receptor M3(Homo sapiens (Human))
Theravance
US Patent
LigandPNGBDBM103772(US8551978, I-42 | US8816088, I-42 | US9394275, I-4...)
Affinity DataKi:  0.200nM. Assay description: Radioligand binding assay using muscarinic receptors.
In DepthDetails US Patent
TargetMuscarinic acetylcholine receptor M3(Homo sapiens (Human))
Theravance
US Patent
LigandPNGBDBM103772(US8551978, I-42 | US8816088, I-42 | US9394275, I-4...)
Affinity DataKi:  0.200nM. Assay description: Radioligand binding assays for cloned muscarinic receptors were performed in 96-well microtiter plates in a total assay volume of 100 uL. CHO cell me...
In DepthDetails US Patent
TargetMuscarinic acetylcholine receptor M3(Homo sapiens (Human))
Theravance
US Patent
LigandPNGBDBM103772(US8551978, I-42 | US8816088, I-42 | US9394275, I-4...)
Affinity DataKi:  0.200nM ΔG°:  -13.8kcal/moleT: 2°C. Assay description: Displacement assays for determination of Ki values of test compounds were performed with [3H]-NMS at 1 nM and eleven different test compound concentr...
In DepthDetails US Patent
TargetMuscarinic acetylcholine receptor M3(Homo sapiens (Human))
Theravance
US Patent
LigandPNGBDBM103772(US8551978, I-42 | US8816088, I-42 | US9394275, I-4...)
Affinity DataKi:  0.200nM. Assay description: compounds were performed with [3H]NMS at 1 nM and eleven different test compound concentrations. The test compounds were initially dissolved to a con...
In DepthDetails US Patent
TargetMuscarinic acetylcholine receptor M3(Homo sapiens (Human))
Theravance
US Patent
LigandPNGBDBM103772(US8551978, I-42 | US8816088, I-42 | US9394275, I-4...)
Affinity DataKi:  0.200nM. Assay description: Radioligand binding assays for cloned muscarinic receptors were performed in 96-well microtiter plates in a total assay volume of 100 μL. CHO ce...
In DepthDetails US Patent
TargetBeta-2 adrenergic receptor(Homo sapiens (Human))
Theravance Respiratory
US Patent
LigandPNGBDBM103772(US8551978, I-42 | US8816088, I-42 | US9394275, I-4...)
Affinity DataEC50:  1nMT: 2°C. Assay description: cAMP assays were performed in a radioimmunoassay format using the Flashplate Adenylyl Cyclase Activation Assay System with [125I]-cAMP (NEN SMP004, P...
In DepthDetails US Patent
TargetBeta-2 adrenergic receptor(Homo sapiens (Human))
Theravance Respiratory
US Patent
LigandPNGBDBM103772(US8551978, I-42 | US8816088, I-42 | US9394275, I-4...)
Affinity DataEC50:  1nMT: 2°C. Assay description: cAMP assays were performed in a radioimmunoassay format using the Flashplate Adenylyl Cyclase Activation Assay System with [125I]-cAMP (NEN SMP004, P...
In DepthDetails US Patent