BDBM104005 LecB Inhibitor Sulfonamides 5d
SMILES COC1O[C@H](CNS(=O)(=O)c2ccc(cc2)[N+](O)=O)[C@@H](O)C(O)[C@@H]1O
InChI Key InChIKey=GXWABTUKHIEUJA-SRMYXAEUSA-N
Data  1 IC50
  Tab Delimited (TSV)   2D SDfile   Computed 3D by Vconf -m prep SDfile
Find this compound or compounds like it in BindingDB:
Activity Spreadsheet -- Enzyme Inhibition Constant Data from BindingDB
Found 1 hit for monomerid = 104005
TargetFucose-binding lectin PA-IIL(Pseudomonas aeruginosa)
University Of Konstanz
LigandPNGBDBM104005(LecB Inhibitor Sulfonamides 5d)
Affinity DataIC50:  3.61E+4nM
In DepthDetails ArticlePubMed