BDBM10419 10-N-Demethyl-10-N-(3-trimethylammoniumpropyl) galanthamine bromide::galanthamine deriv. 5a::{3-[(1S,12S,14R)-14-hydroxy-9-methoxy-11-oxa-4-azatetracyclo[8.6.1.0^{1,12}.0^{6,17}]heptadeca-6(17),7,9,15-tetraen-4-yl]propyl}trimethylazanium bromide
SMILES COc1ccc2CN(CCC[N+](C)(C)C)CC[C@@]34C=C[C@H](O)C[C@@H]3Oc1c24
InChI Key InChIKey=IJYAXGWEXZSXQH-JLMWRMLUSA-N
Data  1 IC50
  Tab Delimited (TSV)   2D SDfile   Computed 3D by Vconf -m prep SDfile
Find this compound or compounds like it in BindingDB:
Activity Spreadsheet -- Enzyme Inhibition Constant Data from BindingDB
Found 1 hit for monomerid = 10419
TargetAcetylcholinesterase(Tetronarce californica (Pacific electric ray) (Tor...)
Cnrs
LigandPNGBDBM10419(10-N-Demethyl-10-N-(3-trimethylammoniumpropyl) gal...)
Affinity DataIC50:  1.24E+4nMpH: 8.0 T: 2°C. Assay description: The cholinesterase assays were performed using colorimetric method reported by Ellman. Enzyme activity was determined by measuring the absorbance at ...
In DepthDetails ArticlePubMed