BDBM10435 8-(Phthalimidooctyl)-trimethylammonium bromide::[8-(1,3-dioxo-2,3-dihydro-1H-isoindol-2-yl)octyl]trimethylazanium bromide::galanthamine deriv. 13d
SMILES C[N+](C)(C)CCCCCCCCN1C(=O)c2ccccc2C1=O
InChI Key InChIKey=CAQWEZOEOAAJOB-UHFFFAOYSA-N
Data  1 IC50
  Tab Delimited (TSV)   2D SDfile   Computed 3D by Vconf -m prep SDfile
Find this compound or compounds like it in BindingDB:
Activity Spreadsheet -- Enzyme Inhibition Constant Data from BindingDB
Found 1 hit for monomerid = 10435
TargetAcetylcholinesterase(Tetronarce californica (Pacific electric ray) (Tor...)
Cnrs
LigandPNGBDBM10435(8-(Phthalimidooctyl)-trimethylammonium bromide | [...)
Affinity DataIC50:  900nM. Assay description: The cholinesterase assays were performed using colorimetric method reported by Ellman. Enzyme activity was determined by measuring the absorbance at ...
In DepthDetails ArticlePubMed