BDBM1049 Hydroxyethylene dipeptide isostere 41::tert-butyl N-[(2S,3S,5R)-3-hydroxy-5-{[(1S,2R)-2-hydroxy-2,3-dihydro-1H-inden-1-yl]carbamoyl}-5-[(4-{2-[(2-methoxyethoxy)methoxy]ethyl}phenyl)methyl]-1-phenylpentan-2-yl]carbamate
SMILES [H][C@@]1(NC(=O)[C@@H](C[C@H](O)[C@H](Cc2ccccc2)NC(=O)OC(C)(C)C)Cc2ccc(CCOCOCCOC)cc2)[C@H](O)Cc2ccccc12
InChI Key InChIKey=XSAZXCCZKMWBKB-JSLQOGGJSA-N
Data  1 IC50
  Tab Delimited (TSV)   2D SDfile   Computed 3D by Vconf -m prep SDfile
Find this compound or compounds like it in BindingDB:
Activity Spreadsheet -- Enzyme Inhibition Constant Data from BindingDB
Found 1 hit for monomerid = 1049
TargetDimer of Gag-Pol polyprotein [489-587](Human immunodeficiency virus type 1)
Merck Research Laboratories
LigandPNGBDBM1049(Hydroxyethylene dipeptide isostere 41 | tert-butyl...)
Affinity DataIC50:  0.130nMpH: 5.5 T: 2°C. Assay description: Assay of HIV protease inhibition was performed by peptide cleavage using the substrate Val-Ser-Gln-Asn-beta-naphthylalanine*Pro-Ile-Val. Products of ...
In DepthDetails ArticlePubMed