BDBM10543 (3S)-5-(benzylsulfanyl)-3-[(2S)-2-(2-hydroxy-2,2-diphenylacetamido)-3-methylbutanamido]-4-oxopentanoic acid::valine aspartyl ketone 22
SMILES CC(C)[C@H](NC(=O)C(O)(c1ccccc1)c1ccccc1)C(=O)N[C@@H](CC(O)=O)C(=O)CSCc1ccccc1
InChI Key InChIKey=NIPMRQKBSDRVPG-LSYYVWMOSA-N
Data  4 IC50
  Tab Delimited (TSV)   2D SDfile   Computed 3D by Vconf -m prep SDfile
Find this compound or compounds like it in BindingDB:
Activity Spreadsheet -- Enzyme Inhibition Constant Data from BindingDB
Found 4 hits for monomerid = 10543
TargetCaspase-3(Homo sapiens (Human))
Merck Frosst Canada
LigandPNGBDBM10543((3S)-5-(benzylsulfanyl)-3-[(2S)-2-(2-hydroxy-2,2-d...)
Affinity DataIC50:  1.30E+3nM. Assay description: The substrate peptides terminating in AMC are processed by caspases with or without inhibitors, and the accumulation of AMC was assessed with a Cytof...
In DepthDetails ArticlePubMed
TargetCaspase-8(Homo sapiens (Human))
Merck Frosst Canada
LigandPNGBDBM10543((3S)-5-(benzylsulfanyl)-3-[(2S)-2-(2-hydroxy-2,2-d...)
Affinity DataIC50: >1.00E+4nM. Assay description: The substrate peptides terminating in AMC are processed by caspases with or without inhibitors, and the accumulation of AMC was assessed with a Cytof...
In DepthDetails ArticlePubMed
TargetCaspase-7(Homo sapiens (Human))
Merck Frosst Canada
LigandPNGBDBM10543((3S)-5-(benzylsulfanyl)-3-[(2S)-2-(2-hydroxy-2,2-d...)
Affinity DataIC50: >1.00E+4nM. Assay description: The substrate peptides terminating in AMC are processed by caspases with or without inhibitors, and the accumulation of AMC was assessed with a Cytof...
In DepthDetails ArticlePubMed
TargetCaspase-1(Homo sapiens (Human))
Merck Frosst Canada
LigandPNGBDBM10543((3S)-5-(benzylsulfanyl)-3-[(2S)-2-(2-hydroxy-2,2-d...)
Affinity DataIC50: >1.00E+4nM. Assay description: The substrate peptides terminating in AMC are processed by caspases with or without inhibitors, and the accumulation of AMC was assessed with a Cytof...
In DepthDetails ArticlePubMed