BDBM10544 (3S)-5-(benzylsulfanyl)-3-[(2S)-2-(2-ethyl-2-hydroxybutanamido)-3-methylbutanamido]-4-oxopentanoic acid::valine aspartyl ketone 23
SMILES CCC(O)(CC)C(=O)N[C@@H](C(C)C)C(=O)N[C@@H](CC(O)=O)C(=O)CSCc1ccccc1
InChI Key InChIKey=NPPMWBNLEVQVOR-PXNSSMCTSA-N
Data  4 IC50
  Tab Delimited (TSV)   2D SDfile   Computed 3D by Vconf -m prep SDfile
Find this compound or compounds like it in BindingDB:
Activity Spreadsheet -- Enzyme Inhibition Constant Data from BindingDB
Found 4 hits for monomerid = 10544
TargetCaspase-3(Homo sapiens (Human))
Merck Frosst Canada
LigandPNGBDBM10544((3S)-5-(benzylsulfanyl)-3-[(2S)-2-(2-ethyl-2-hydro...)
Affinity DataIC50:  2.02E+3nM. Assay description: The substrate peptides terminating in AMC are processed by caspases with or without inhibitors, and the accumulation of AMC was assessed with a Cytof...
In DepthDetails ArticlePubMed
TargetCaspase-8(Homo sapiens (Human))
Merck Frosst Canada
LigandPNGBDBM10544((3S)-5-(benzylsulfanyl)-3-[(2S)-2-(2-ethyl-2-hydro...)
Affinity DataIC50:  9.58E+3nM. Assay description: The substrate peptides terminating in AMC are processed by caspases with or without inhibitors, and the accumulation of AMC was assessed with a Cytof...
In DepthDetails ArticlePubMed
TargetCaspase-7(Homo sapiens (Human))
Merck Frosst Canada
LigandPNGBDBM10544((3S)-5-(benzylsulfanyl)-3-[(2S)-2-(2-ethyl-2-hydro...)
Affinity DataIC50: >1.00E+4nM. Assay description: The substrate peptides terminating in AMC are processed by caspases with or without inhibitors, and the accumulation of AMC was assessed with a Cytof...
In DepthDetails ArticlePubMed
TargetCaspase-1(Homo sapiens (Human))
Merck Frosst Canada
LigandPNGBDBM10544((3S)-5-(benzylsulfanyl)-3-[(2S)-2-(2-ethyl-2-hydro...)
Affinity DataIC50: >1.00E+4nM. Assay description: The substrate peptides terminating in AMC are processed by caspases with or without inhibitors, and the accumulation of AMC was assessed with a Cytof...
In DepthDetails ArticlePubMed