BDBM107037 US8592432, 11
SMILES CC(C)Oc1cc2CN(C3CCN(CC3)C(=O)CN(C)C)C(=O)c2cc1Nc1ncc(Cl)c(Nc2ccccc2S(=O)(=O)C2CCC2)n1
InChI Key InChIKey=VRSBBOUWXNVSKO-UHFFFAOYSA-N
Data  1 IC50
  Tab Delimited (TSV)   2D SDfile   Computed 3D by Vconf -m prep SDfile
Find this compound or compounds like it in BindingDB:
Activity Spreadsheet -- Enzyme Inhibition Constant Data from BindingDB
Found 1 hit for monomerid = 107037
TargetALK tyrosine kinase receptor(Homo sapiens (Human))
TBA
US Patent
LigandPNGBDBM107037(US8592432, 11)
Affinity DataIC50:  2nM. Assay description: The inhibition of ALK tyrosine kinase activity may be demonstrated using known methods, for example using the recombinant kinase domain of the ALK in...
In DepthDetails US Patent