BDBM10919 3-{[methyl({3-[(9-oxo-9H-xanthen-3-yl)oxy]propyl})amino]methyl}phenyl N-phenylcarbamate hydrochloride::CHEMBL128260::Compound 12.HCl::aminoalkoxyheteroaryl deriv. 12
SMILES CN(CCCOc1ccc2c(c1)oc1ccccc1c2=O)Cc1cccc(OC(=O)Nc2ccccc2)c1
InChI Key InChIKey=JLIDJRGQAIERBG-UHFFFAOYSA-N
Data  4 IC50
  Tab Delimited (TSV)   2D SDfile   Computed 3D by Vconf -m prep SDfile
Find this compound or compounds like it in BindingDB:
Activity Spreadsheet -- Enzyme Inhibition Constant Data from BindingDB
Found 4 hits for monomerid = 10919
TargetAcetylcholinesterase(Homo sapiens (Human))
University Of Bologna
LigandPNGBDBM10919(3-{[methyl({3-[(9-oxo-9H-xanthen-3-yl)oxy]propyl})...)
Affinity DataIC50:  2.80nMpH: 8.0 T: 2°C. Assay description: The cholinesterase assays were performed using colorimetric method reported by Ellman. The absorbance changes at 412 nm were recorded for 5 min with ...
In DepthDetails ArticlePubMed
TargetAcetylcholinesterase(Homo sapiens (Human))
University Of Bologna
LigandPNGBDBM10919(3-{[methyl({3-[(9-oxo-9H-xanthen-3-yl)oxy]propyl})...)
Affinity DataIC50:  2.80nM. Assay description: Inhibition of acetylcholinesterase (unknown origin)
In DepthDetails Article
TargetAcetylcholinesterase(Homo sapiens (Human))
University Of Bologna
LigandPNGBDBM10919(3-{[methyl({3-[(9-oxo-9H-xanthen-3-yl)oxy]propyl})...)
Affinity DataIC50:  2.80nM. Assay description: Inhibition of AChE
In DepthDetails ArticlePubMed
TargetCholinesterase(Homo sapiens (Human))
University Of Bologna
LigandPNGBDBM10919(3-{[methyl({3-[(9-oxo-9H-xanthen-3-yl)oxy]propyl})...)
Affinity DataIC50:  200nM. Assay description: The cholinesterase assays were performed using colorimetric method reported by Ellman. The absorbance changes at 412 nm were recorded for 5 min with ...
In DepthDetails ArticlePubMed