BDBM109206 2-[(1E,3E)-5-[(2E)-3-(3-{[(5R)-5-carbamoyl-5-[(4- {[13-chloro-10-(2-fluoro-6-methoxyphenyl)-3,5,9- triazatricyclo[9.4.0.0,⁷]pentadeca- 1(11),2(7),3,5,9,12,14-heptaen-4-yl]amino}-2- methoxyphenyl)formamido]pentyl]carbamoyl}propyl)-1- ethyl-3-methyl-5-sulfoindol-2-ylidene]penta-1,3- dien-1-yl]-1-ethyl-3,3-dimethylindol-1-ium-5- sulfonate (Compound I)::Compound I: MLN8237*-D-Lys(PromoFluor 647)-NH2
SMILES CCN1\C(=C\C=C\C=C\C2=[N+](CC)c3ccc(cc3C2(C)C)S([O-])(=O)=O)C(C)(CCCC(=O)NCCCC[C@@H](NC(=O)c2ccc(Nc3ncc4CN=C(c5cc(Cl)ccc5-c4n3)c3c(F)cccc3OC)cc2OC)C(N)=O)c2cc(ccc12)S(O)(=O)=O
InChI Key InChIKey=KBWQVCDVBPIONT-QLLCQSQASA-N
Data  2 Kd
  Tab Delimited (TSV)   2D SDfile   Computed 3D by Vconf -m prep SDfile
Find this compound or compounds like it in BindingDB:
Activity Spreadsheet -- Enzyme Inhibition Constant Data from BindingDB
Found 2 hits for monomerid = 109206
TargetAurora kinase A/Targeting protein for Xklp2 [1-43](Homo sapiens (Human))
University Of Tartu
LigandPNGBDBM109206(2-[(1E,3E)-5-[(2E)-3-(3-{[(5R)-5-carbamoyl-5-[(4- ...)
Affinity DataKd:  0.527nMT: 2°C. Assay description: A stock solution was prepared containing complex of Aurora A and Compound I (final total concentrations of 6nM and 5nM, respectively). Separately, se...
In DepthDetails ArticlePubMed
TargetAurora kinase A(Homo sapiens (Human))
University Of Tartu
LigandPNGBDBM109206(2-[(1E,3E)-5-[(2E)-3-(3-{[(5R)-5-carbamoyl-5-[(4- ...)
Affinity DataKd:  0.273nMT: 2°C. Assay description: A stock solution was prepared containing complex of Aurora A and Compound I (final total concentrations of 6nM and 5nM, respectively). Separately, se...
In DepthDetails ArticlePubMed