BDBM109660 US8609715, A-68
SMILES NC(=N)c1ccc(OC(=O)c2ccc(o2)-c2ccc(cc2)C(=O)N[C@@H](CC(O)=O)C(O)=O)cc1
InChI Key InChIKey=BLKGMXVBRRZSBK-INIZCTEOSA-N
Data  2 KI
  Tab Delimited (TSV)   2D SDfile   Computed 3D by Vconf -m prep SDfile
Find this compound or compounds like it in BindingDB:
Activity Spreadsheet -- Enzyme Inhibition Constant Data from BindingDB
Found 2 hits for monomerid = 109660
TargetSerine protease 1(Homo sapiens (Human))
Ajinomoto
US Patent
LigandPNGBDBM109660(US8609715, A-68)
Affinity DataKi:  0.230nM. Assay description: Inhibition assay using human trysin.
In DepthDetails US Patent
TargetEnteropeptidase(Homo sapiens (Human))
Ajinomoto
US Patent
LigandPNGBDBM109660(US8609715, A-68)
Affinity DataKi:  2.20nM. Assay description: Inhibition assay using human enteropeptidase.
In DepthDetails US Patent