BDBM109813 US8618299, 31
SMILES Cc1ccc(COc2ccn(-c3ccc4c5CN6CCCC6Cc5n(C)c4c3)c(=O)c2)cn1
InChI Key InChIKey=IJJGYIQENRFGNM-UHFFFAOYSA-N
Data  1 KI
  Tab Delimited (TSV)   2D SDfile   Computed 3D by Vconf -m prep SDfile
Find this compound or compounds like it in BindingDB:
Activity Spreadsheet -- Enzyme Inhibition Constant Data from BindingDB
Found 1 hit for monomerid = 109813
TargetMelanin-concentrating hormone receptor 1(Homo sapiens (Human))
Albany Molecular Research
US Patent
LigandPNGBDBM109813(US8618299, 31)
Affinity DataKi:  22nM. Assay description: Evaluation of the affinity of compounds for the human MCH-1 receptor was accomplished using 4-(3,4,5-tritritiumbenzyloxy)-1-(1-(2-(pyrrolidin-1-yl)et...
In DepthDetails US Patent