BDBM11101 2-cyanopyrrolidine 21ah::3-bromo-4-{[(2R,5S)-5-{[(2S)-2-cyanopyrrolidin-1-yl]carbonyl}pyrrolidin-2-yl]methoxy}benzoic acid
SMILES OC(=O)c1ccc(OC[C@H]2CC[C@H](N2)C(=O)N2CCC[C@H]2C#N)c(Br)c1
InChI Key InChIKey=BIDCPCXBDQEAOX-IPYPFGDCSA-N
Data  1 KI
  Tab Delimited (TSV)   2D SDfile   Computed 3D by Vconf -m prep SDfile
Find this compound or compounds like it in BindingDB:
Activity Spreadsheet -- Enzyme Inhibition Constant Data from BindingDB
Found 1 hit for monomerid = 11101
TargetDipeptidyl peptidase 4(Homo sapiens (Human))
Abbott Laboratories
LigandPNGBDBM11101(2-cyanopyrrolidine 21ah | 3-bromo-4-{[(2R,5S)-5-{[...)
Affinity DataKi:  0.660nM. Assay description: The DPP4 activity resulted in the formation of the fluorescent product amidomethylcoumarin (AMC), which was monitored by excitation at 355 nm and mea...
In DepthDetails ArticlePubMed