BDBM11306 Compound 2 analog 17::N-[3-(5-tert-butyl-2-methylfuran-3-yl)-1H-pyrazol-5-yl]thiophene-2-sulfonamide::acs.jmedchem.1c00409_ST.509::cmdc.202100576, 7f
SMILES Cc1oc(cc1-c1cc(NS(=O)(=O)c2cccs2)[nH]n1)C(C)(C)C
InChI Key InChIKey=HUNAFKUGDBHPEN-UHFFFAOYSA-N
Data  3 IC50
  Tab Delimited (TSV)   2D SDfile   Computed 3D by Vconf -m prep SDfile
Find this compound or compounds like it in BindingDB:
Activity Spreadsheet -- Enzyme Inhibition Constant Data from BindingDB
Found 3 hits for monomerid = 11306
TargetReplicase polyprotein 1ab(Human SARS coronavirus (SARS-CoV) (Severe acute re...)
National Defense Medical Center
LigandPNGBDBM11306(Compound 2 analog 17 | N-[3-(5-tert-butyl-2-methyl...)
Affinity DataIC50:  1.00E+4nM. Assay description: The effects of compound on enzyme activity were measured by using a fluorogenic peptide cleavage assay. Enhanced fluorescence caused by cleavage of t...
In DepthDetails ArticlePubMed
TargetReplicase polyprotein 1ab(Human SARS coronavirus (SARS-CoV) (Severe acute re...)
National Defense Medical Center
LigandPNGBDBM11306(Compound 2 analog 17 | N-[3-(5-tert-butyl-2-methyl...)
Affinity DataIC50:  1.00E+4nM. Assay description: This is a review article. Please point to the original journal.
In DepthDetails ArticlePubMed
TargetReplicase polyprotein 1ab(Human SARS coronavirus (SARS-CoV) (Severe acute re...)
National Defense Medical Center
LigandPNGBDBM11306(Compound 2 analog 17 | N-[3-(5-tert-butyl-2-methyl...)
Affinity DataIC50:  1.00E+4nM. Assay description: Please point to the patents.
In DepthDetails ArticlePubMed