BDBM118144 US8653091, 39
SMILES CC(Nc1ncnc2CCN(Cc12)c1ccc(C)cn1)c1ccc(Cl)c(F)c1
InChI Key InChIKey=CNUGQOFQIIDDCR-UHFFFAOYSA-N
Data  1 IC50
  Tab Delimited (TSV)   2D SDfile   Computed 3D by Vconf -m prep SDfile
Find this compound or compounds like it in BindingDB:
Activity Spreadsheet -- Enzyme Inhibition Constant Data from BindingDB
Found 1 hit for monomerid = 118144
TargetP2X purinoceptor 3(Homo sapiens (Human))
Evotec
US Patent
LigandPNGBDBM118144(US8653091, 39)
Affinity DataIC50:  43nM. Assay description: The purinergic receptors P2X2 and P2X3 are expressed in a variety of tissues including various sensory and sympathetic ganglia, such as the dorsal ro...
In DepthDetails US Patent