BDBM118152 US8653091, 47
SMILES COc1cccc(c1)[C@@H](C)Nc1ncnc2CCN(Cc12)c1ccc(C)cn1
InChI Key InChIKey=BSHIAFMHMKJSPC-MRXNPFEDSA-N
Data  1 IC50
  Tab Delimited (TSV)   2D SDfile   Computed 3D by Vconf -m prep SDfile
Find this compound or compounds like it in BindingDB:
Activity Spreadsheet -- Enzyme Inhibition Constant Data from BindingDB
Found 1 hit for monomerid = 118152
TargetP2X purinoceptor 3(Homo sapiens (Human))
Evotec
US Patent
LigandPNGBDBM118152(US8653091, 47)
Affinity DataIC50:  21nM. Assay description: The purinergic receptors P2X2 and P2X3 are expressed in a variety of tissues including various sensory and sympathetic ganglia, such as the dorsal ro...
In DepthDetails US Patent