BDBM118168 US8653091, 63
SMILES Cc1ccc(nc1)N1CCc2ncnc(N[C@H](CCO)c3ccc(nc3)C(F)(F)F)c2C1
InChI Key InChIKey=JYXGOVPRQNIYKV-QGZVFWFLSA-N
Data  1 IC50
  Tab Delimited (TSV)   2D SDfile   Computed 3D by Vconf -m prep SDfile
Find this compound or compounds like it in BindingDB:
Activity Spreadsheet -- Enzyme Inhibition Constant Data from BindingDB
Found 1 hit for monomerid = 118168
TargetP2X purinoceptor 3(Homo sapiens (Human))
Evotec
US Patent
LigandPNGBDBM118168(US8653091, 63)
Affinity DataIC50:  24nM. Assay description: The purinergic receptors P2X2 and P2X3 are expressed in a variety of tissues including various sensory and sympathetic ganglia, such as the dorsal ro...
In DepthDetails US Patent