BDBM118313 US8653092, 81
SMILES CCC(=O)N1CC[C@@H](C1)Nc1ncnc2CCN(Cc12)c1cnc(OC)c(C)c1
InChI Key InChIKey=CEVKJROQTHRTGX-HNNXBMFYSA-N
Data  9 IC50
  Tab Delimited (TSV)   2D SDfile   Computed 3D by Vconf -m prep SDfile
Find this compound or compounds like it in BindingDB:
Activity Spreadsheet -- Enzyme Inhibition Constant Data from BindingDB
Found 9 hits for monomerid = 118313
LigandPNGBDBM118313(US8653092, 81)
Affinity DataIC50:  651nM. Assay description: Test of Lipid Kinase Activity: The kinase reaction is performed in a final volume of 50 μl per well of a half area COSTAR, 96 well plate. The fi...
In DepthDetails US Patent
LigandPNGBDBM118313(US8653092, 81)
Affinity DataIC50:  20nM. Assay description: Test of Lipid Kinase Activity: The kinase reaction is performed in a final volume of 50 μl per well of a half area COSTAR, 96 well plate. The fi...
In DepthDetails US Patent
LigandPNGBDBM118313(US8653092, 81)
Affinity DataIC50:  20nM. Assay description: Inhibition of PI3Kdelta (unknown origin) using phosphatidyl inositol as substrate measured after 60 mins by Alexa Fluor647-labelled ADP tracer based ...
In DepthDetails ArticlePubMed
LigandPNGBDBM118313(US8653092, 81)
Affinity DataIC50:  246nM. Assay description: Inhibition of recombinant human myristoylated PI3Kdelta catalytic domain expressed in Rat1 cells assessed as reduction in Akt phosphorylation at Ser4...
In DepthDetails ArticlePubMed
TargetPhosphatidylinositol 4,5-bisphosphate 3-kinase catalytic subunit beta isoform(Homo sapiens (Human))
Novartis Institutes For Biomedical Research
Curated by ChEMBL
LigandPNGBDBM118313(US8653092, 81)
Affinity DataIC50:  7.91E+3nM. Assay description: Inhibition of recombinant human myristoylated PI3Kbeta catalytic domain expressed in Rat1 cells assessed as reduction in Akt phosphorylation at Ser47...
In DepthDetails ArticlePubMed
LigandPNGBDBM118313(US8653092, 81)
Affinity DataIC50:  7.41E+3nM. Assay description: Inhibition of recombinant human myristoylated PI3Kalpha catalytic domain expressed in Rat1 cells assessed as reduction in Akt phosphorylation at Ser4...
In DepthDetails ArticlePubMed
TargetPhosphatidylinositol 4,5-bisphosphate 3-kinase catalytic subunit delta isoform(Mus musculus (Mouse))
Novartis Institutes For Biomedical Research
Curated by ChEMBL
LigandPNGBDBM118313(US8653092, 81)
Affinity DataIC50:  87nM. Assay description: Inhibition of PI3Kdelta in Balb/c mouse splenocytes assessed as reduction in anti-IgM stimulated CD86 expression pretreated for 1 hr followed by anti...
In DepthDetails ArticlePubMed
LigandPNGBDBM118313(US8653092, 81)
Affinity DataIC50:  651nM. Assay description: Inhibition of recombinant human myristoylated PI3Kalpha catalytic domain expressed in Rat1 cells assessed as reduction in Akt phosphorylation at Ser4...
In DepthDetails ArticlePubMed
TargetPhosphatidylinositol 4,5-bisphosphate 3-kinase catalytic subunit beta isoform(Homo sapiens (Human))
Novartis Institutes For Biomedical Research
Curated by ChEMBL
LigandPNGBDBM118313(US8653092, 81)
Affinity DataIC50:  951nM. Assay description: Inhibition of recombinant PI3Kbeta (unknown origin) using phosphatidyl inositol/n-Octyl-glucoside as substrate measured after 60 mins by KinaseGlo as...
In DepthDetails ArticlePubMed