BDBM119311 US8673906, 6::US9718800, 6.0
SMILES CC(N(C)c1cc(F)cc(F)c1)c1cc(cc2c1oc(cc2=O)N1CCOCC1)C(=O)N1CCCC1
InChI Key InChIKey=WFEKZUTYCXQXCD-UHFFFAOYSA-N
Data  7 IC50
  Tab Delimited (TSV)   2D SDfile   Computed 3D by Vconf -m prep SDfile
Find this compound or compounds like it in BindingDB:
Activity Spreadsheet -- Enzyme Inhibition Constant Data from BindingDB
Found 7 hits for monomerid = 119311
LigandPNGBDBM119311(US8673906, 6 | US9718800, 6.0)
Affinity DataIC50:  5nM. Assay description: The inhibition of PI3Kβ, PI3Kα, PI3Kγ and PI3Kδ was evaluated in a Kinase Glo based enzyme activity assay using human recombinant...
In DepthDetails US Patent
LigandPNGBDBM119311(US8673906, 6 | US9718800, 6.0)
Affinity DataIC50:  13nM. Assay description: Inhibition of human recombinant PI3Kbeta using PIP2 by Kinase-Glo Plus assay
In DepthDetails ArticlePubMed
LigandPNGBDBM119311(US8673906, 6 | US9718800, 6.0)
Affinity DataIC50:  3.50E+3nM. Assay description: Inhibition of human recombinant PI3Kgamma using PIP2 by Kinase-Glo Plus assay
In DepthDetails ArticlePubMed
LigandPNGBDBM119311(US8673906, 6 | US9718800, 6.0)
Affinity DataIC50:  5nMT: 2°C. Assay description: Compounds in 100% DMSO were added to assay plates by acoustic dispensing. PI3Kβ was added in a Tris buffer (50 mM Tris pH7.4, 0.05% CHAPS, 2.1 m...
In DepthDetails US Patent
LigandPNGBDBM119311(US8673906, 6 | US9718800, 6.0)
Affinity DataIC50:  100nM. Assay description: Inhibition of PI3Kbeta in PTEN-null human MDA-MB-468 cells assessed as inhibition of Akt phosphorylation after 2 hrs
In DepthDetails ArticlePubMed
LigandPNGBDBM119311(US8673906, 6 | US9718800, 6.0)
Affinity DataIC50:  510nM. Assay description: Inhibition of human recombinant PI3Kalpha using PIP2 by Kinase-Glo Plus assay
In DepthDetails ArticlePubMed
LigandPNGBDBM119311(US8673906, 6 | US9718800, 6.0)
Affinity DataIC50:  120nM. Assay description: Inhibition of human recombinant PI3Kdelta using PIP2 by Kinase-Glo Plus assay
In DepthDetails ArticlePubMed