BDBM12073 (S)-[1-(4-Methoxybiphenyl-4-sulfonylamino)-2-methylpropyl]phosphonic Acid::CHEMBL382201::[(1S)-1-{[4-(4-methoxyphenyl)benzene]sulfonamido}-2-methylpropyl]phosphonic acid::alpha-arylsulfonylamino phosphonate 1S
SMILES COc1ccc(cc1)-c1ccc(cc1)S(=O)(=O)N[C@H](C(C)C)P(O)(O)=O
InChI Key InChIKey=BZVYQWLRCHLAGK-KRWDZBQOSA-N
Data  2 KI  2 IC50  1 Other
PDB links: 1 PDB ID matches this monomer.
  Tab Delimited (TSV)   2D SDfile   Computed 3D by Vconf -m prep SDfile
Find this compound or compounds like it in BindingDB:
Activity Spreadsheet -- Enzyme Inhibition Constant Data from BindingDB
Found 5 hits for monomerid = 12073
TargetNeutrophil collagenase(Homo sapiens (Human))
Istituto Di Cristallografia
LigandPNGBDBM12073((S)-[1-(4-Methoxybiphenyl-4-sulfonylamino)-2-methy...)
Affinity DataKi:  700nM ΔG°:  -8.39kcal/molepH: 7.5 T: 2°C. Assay description: Inhibition of the matrix metalloproteinases MMP-2, MMP-3, and MMP-8 has been determined by continuously monitoring the hydrolysis of the fluorescent ...
Target72 kDa type IV collagenase(Homo sapiens (Human))
Istituto Di Cristallografia
LigandPNGBDBM12073((S)-[1-(4-Methoxybiphenyl-4-sulfonylamino)-2-methy...)
Affinity DataKi:  1.20E+3nM ΔG°:  -8.07kcal/molepH: 7.5 T: 2°C. Assay description: Inhibition of the matrix metalloproteinases MMP-2, MMP-3, and MMP-8 has been determined by continuously monitoring the hydrolysis of the fluorescent ...
In DepthDetails ArticlePubMed
TargetStromelysin-1(Homo sapiens (Human))
Istituto Di Cristallografia
LigandPNGBDBM12073((S)-[1-(4-Methoxybiphenyl-4-sulfonylamino)-2-methy...)
Affinity DatapH: 7.5 T: 2°C. Assay description: Inhibition of the matrix metalloproteinases MMP-2, MMP-3, and MMP-8 has been determined by continuously monitoring the hydrolysis of the fluorescent ...
In DepthDetails ArticlePubMed
Target72 kDa type IV collagenase(Homo sapiens (Human))
Istituto Di Cristallografia
LigandPNGBDBM12073((S)-[1-(4-Methoxybiphenyl-4-sulfonylamino)-2-methy...)
Affinity DataIC50:  1.10E+3nM. Assay description: Inhibition of human recombinant MMP2 expressed in mouse myeloma cells
In DepthDetails ArticlePubMed
TargetNeutrophil collagenase(Homo sapiens (Human))
Istituto Di Cristallografia
LigandPNGBDBM12073((S)-[1-(4-Methoxybiphenyl-4-sulfonylamino)-2-methy...)
Affinity DataIC50:  810nM. Assay description: Inhibition of MMP8