BDBM12155 2-(N-(2-methylphenyl)sulfonylaminocarbonyl-hydrazinocarbonyl)-benzenesulfonamide::N-({[(2-methylbenzene)sulfonyl]carbamoyl}amino)-2-sulfamoylbenzamide::sulfonyl urea 7b
SMILES Cc1ccccc1S(=O)(=O)NC(=O)NNC(=O)c1ccccc1S(N)(=O)=O
InChI Key InChIKey=WVGAHFJRSONPTP-UHFFFAOYSA-N
Data  3 KI
  Tab Delimited (TSV)   2D SDfile   Computed 3D by Vconf -m prep SDfile
Find this compound or compounds like it in BindingDB:
Activity Spreadsheet -- Enzyme Inhibition Constant Data from BindingDB
Found 3 hits for monomerid = 12155
TargetCarbonic anhydrase 9(Homo sapiens (Human))
Universita Degli Studi Di Firenze
LigandPNGBDBM12155(2-(N-(2-methylphenyl)sulfonylaminocarbonyl-hydrazi...)
Affinity DataKi:  83nM. Assay description: An Applied Photophysics stopped-flow instrument has been used for assaying the CA-catalyzed CO2 hydration activity. Phenol red has been used as indic...
In DepthDetails ArticlePubMed
TargetCarbonic anhydrase 2(Homo sapiens (Human))
Universita Degli Studi Di Firenze
LigandPNGBDBM12155(2-(N-(2-methylphenyl)sulfonylaminocarbonyl-hydrazi...)
Affinity DataKi:  92nM. Assay description: An Applied Photophysics stopped-flow instrument has been used for assaying the CA-catalyzed CO2 hydration activity. Phenol red has been used as indic...
In DepthDetails ArticlePubMed
TargetCarbonic anhydrase 1(Homo sapiens (Human))
Universita Degli Studi Di Firenze
LigandPNGBDBM12155(2-(N-(2-methylphenyl)sulfonylaminocarbonyl-hydrazi...)
Affinity DataKi:  4.70E+3nM. Assay description: An Applied Photophysics stopped-flow instrument has been used for assaying the CA-catalyzed CO2 hydration activity. Phenol red has been used as indic...
In DepthDetails ArticlePubMed