BDBM121795 US8722692, 234
SMILES COCCNCCc1ccc(cc1)-c1cc2ncn(C)c(=O)c2c(NC2CC2)n1
InChI Key InChIKey=CNAVUPIXXMBOGM-UHFFFAOYSA-N
Data  1 IC50
  Tab Delimited (TSV)   2D SDfile   Computed 3D by Vconf -m prep SDfile
Find this compound or compounds like it in BindingDB:
Activity Spreadsheet -- Enzyme Inhibition Constant Data from BindingDB
Found 1 hit for monomerid = 121795
TargetTyrosine-protein kinase SYK(Homo sapiens (Human))
TBA
US Patent
LigandPNGBDBM121795(US8722692, 234)
Affinity DataIC50:  156nM. Assay description: Compounds of the examples provided herein were assessed for their ability to inhibit Syk kinase by utilizing Caliper Life Sciences' proprietary L...
In DepthDetails US Patent