BDBM123515 US8748435, 40
SMILES CCc1nc2c(C)cc(C)nc2n1Cc1ccc(\C=C\CN2CCN(CC2)C(C)C)cc1
InChI Key InChIKey=UAMIBPKKKLTAKG-BQYQJAHWSA-N
Data  9 IC50
  Tab Delimited (TSV)   2D SDfile   Computed 3D by Vconf -m prep SDfile
Find this compound or compounds like it in BindingDB:
Activity Spreadsheet -- Enzyme Inhibition Constant Data from BindingDB
Found 9 hits for monomerid = 123515
TargetG-protein coupled receptor 4(Homo sapiens (Human))
Novartis
US Patent
LigandPNGBDBM123515(US8748435, 40)
Affinity DataIC50:  55nMpH: 8.0Assay Description:Serial dilutions of compounds (stock in 10 mM DMSO) are prepared by first diluting the compounds in DMSO followed by a 1:50 dilution into assay buffe...
In DepthDetails US Patent
TargetG-protein coupled receptor 4(Mus musculus)
Novartis Institutes For Biomedical Research
Curated by ChEMBL
LigandPNGBDBM123515(US8748435, 40)
Affinity DataIC50:  1.29E+3nM. Assay description: Antagonist activity at mouse GPR4 expressed in HEK cells assessed as inhibition of pH-induced cAMP accumulation preincubated for 15 mins followed by ...
In DepthDetails ArticlePubMed
TargetG-protein coupled receptor 4(Homo sapiens (Human))
Novartis
US Patent
LigandPNGBDBM123515(US8748435, 40)
Affinity DataIC50:  110nM. Assay description: Antagonist activity at human GPR4 expressed in human HeLa cells assessed as inhibition of pH-induced cAMP accumulation preincubated for 15 mins follo...
In DepthDetails ArticlePubMed
TargetHistamine H3 receptor(Homo sapiens (Human))
Novartis Institutes For Biomedical Research
Curated by ChEMBL
LigandPNGBDBM123515(US8748435, 40)
Affinity DataIC50:  930nM. Assay description: Antagonist activity at histamine H3 receptor (unknown origin)
In DepthDetails ArticlePubMed
TargetPotassium voltage-gated channel subfamily H member 2(Homo sapiens (Human))
Novartis Institutes For Biomedical Research
Curated by ChEMBL
LigandPNGBDBM123515(US8748435, 40)
Affinity DataIC50:  1.00E+3nM. Assay description: Antagonist activity at human GPR4 expressed in human HeLa cells assessed as inhibition of pH-induced cAMP accumulation preincubated for 15 mins follo...
In DepthDetails ArticlePubMed
TargetG-protein coupled receptor 4(Homo sapiens (Human))
Novartis
US Patent
LigandPNGBDBM123515(US8748435, 40)
Affinity DataIC50:  114nM. Assay description: Antagonist activity at human GPR4 expressed in human HeLa cells assessed as inhibition of IBMX-induced cAMP accumulation after 15 mins by HTRF assay
In DepthDetails ArticlePubMed
TargetPotassium voltage-gated channel subfamily H member 2(Homo sapiens (Human))
Novartis Institutes For Biomedical Research
Curated by ChEMBL
LigandPNGBDBM123515(US8748435, 40)
Affinity DataIC50:  1.00E+3nM. Assay description: Displacement of [3H]dofetilide from recombinant human ERG expressed in HEK293 cell membranes after 90 mins by liquid scintillation counting method
In DepthDetails ArticlePubMed
TargetHistamine H3 receptor(Homo sapiens (Human))
Novartis Institutes For Biomedical Research
Curated by ChEMBL
LigandPNGBDBM123515(US8748435, 40)
Affinity DataIC50:  930nM. Assay description: Displacement of [3H]-R(-)-alpha-Methyl[imidazole-2.5(n)]histamine from human recombinant histamine H3 receptor expressed in CHOK1 cell membranes afte...
In DepthDetails ArticlePubMed
TargetG-protein coupled receptor 4(Rattus norvegicus)
Novartis Institutes For Biomedical Research
Curated by ChEMBL
LigandPNGBDBM123515(US8748435, 40)
Affinity DataIC50:  800nM. Assay description: Antagonist activity at rat GPR4 expressed in HEK cells assessed as inhibition of pH-induced cAMP accumulation preincubated for 15 mins followed by cA...
In DepthDetails ArticlePubMed