BDBM123777 (2S,3S)-2-amino-1-[(3S)-3-fluoropyrrolidin-1-yl]-3- {4-[3-(1H-1,2,3,4-tetrazol-5- yl)phenyl]phenyl}butan-1-one (12)
SMILES C[C@H]([C@H](N)C(=O)N1CC[C@H](F)C1)c1ccc(cc1)-c1cccc(c1)-c1nnn[nH]1
InChI Key InChIKey=BCDMNHGZHZHNEL-AGRHKRQWSA-N
Data  1 IC50
  Tab Delimited (TSV)   2D SDfile   Computed 3D by Vconf -m prep SDfile
Find this compound or compounds like it in BindingDB:
Activity Spreadsheet -- Enzyme Inhibition Constant Data from BindingDB
Found 1 hit for monomerid = 123777
TargetDipeptidyl peptidase 4(Homo sapiens (Human))
China Pharmaceutical University
LigandPNGBDBM123777((2S,3S)-2-amino-1-[(3S)-3-fluoropyrrolidin-1-yl]-3...)
Affinity DataIC50:  6nM. Assay description: The HypoGen module in DS2.5 was employed to produce pharmaphores with the training set compounds.
In DepthDetails ArticlePubMed