BDBM124230 1-(4-(2-Methoxy-2-oxoacetyl)phenyl)-1H-1,2,3-triazol-4- ylmethyl 2,3,4,6-tetra-O-benzyl-a-D-glucopyranoside (17)
SMILES COC(=O)C(=O)c1ccc(cc1)-n1cc(CO[C@H]2O[C@H](COCc3ccccc3)[C@@H](OCc3ccccc3)[C@H](OCc3ccccc3)[C@H]2OCc2ccccc2)nn1
InChI Key InChIKey=VDANFTJHLYOAAZ-OJNKIDGWSA-N
Data  1 IC50
  Tab Delimited (TSV)   2D SDfile   Computed 3D by Vconf -m prep SDfile
Find this compound or compounds like it in BindingDB:
Activity Spreadsheet -- Enzyme Inhibition Constant Data from BindingDB
Found 1 hit for monomerid = 124230
TargetTyrosine-protein phosphatase non-receptor type 1(Homo sapiens (Human))
East China University Of Science And Technology
LigandPNGBDBM124230(1-(4-(2-Methoxy-2-oxoacetyl)phenyl)-1H-1,2,3-triaz...)
Affinity DataIC50:  1.23E+4nMT: 2°C. Assay description: The assay mixture (100 ??L) containing 50 mM MOPS (pH 6.5), 2 mM pNPP and PTP1B were monitored at 405 nm for 2 min at 30 ??C.
In DepthDetails ArticlePubMed