BDBM124959 US8765972, 18
SMILES CC1N(C2CCN(CC2)C2CCC2)C(=O)c2c1cccc2C(N)=O
InChI Key InChIKey=USRQMGAPHKQEBJ-UHFFFAOYSA-N
Data  1 Kd
  Tab Delimited (TSV)   2D SDfile   Computed 3D by Vconf -m prep SDfile
Find this compound or compounds like it in BindingDB:
Activity Spreadsheet -- Enzyme Inhibition Constant Data from BindingDB
Found 1 hit for monomerid = 124959
TargetPoly [ADP-ribose] polymerase 1(Homo sapiens (Human))
Nerviano Medical Sciences
US Patent
LigandPNGBDBM124959(US8765972, 18)
Affinity DataKd:  10nM. Assay description: Affinity evaluation of the tested compounds and their selectivity with respect to the different PARP isoforms of interest was assessed in a displacem...
In DepthDetails US Patent