BDBM124965 US8765820, 7
SMILES NC1CC1c1ccc(NC(=O)C(Cc2ccccc2)NC(=O)OCc2ccc(Br)cc2)cc1
InChI Key InChIKey=VIVIDGJRIUZLHP-UHFFFAOYSA-N
Data  1 KI
  Tab Delimited (TSV)   2D SDfile   Computed 3D by Vconf -m prep SDfile
Find this compound or compounds like it in BindingDB:
Activity Spreadsheet -- Enzyme Inhibition Constant Data from BindingDB
Found 1 hit for monomerid = 124965
TargetLysine-specific histone demethylase 1A(Homo sapiens (Human))
Sapienza University Of Rome
US Patent
LigandPNGBDBM124965(US8765820, 7)
Affinity DataKi:  3.30E+3nMpH: 7.5Assay Description:Human recombinant MAO A and MAO B were expressed in Pichia pastoris and purified as published (Binda C, et al., Proc. Natl. Acad. Sci. USA 100: 9750-...
In DepthDetails US Patent