BDBM126177 US8778957, 88
SMILES O=C1Nc2ncccc2[C@@]11Cc2cc3ccc(CN4CC5(CCCC5)NC(=O)[C@H]4Cc4ccccc4)nc3cc2C1
InChI Key InChIKey=FOJKIJVGVRNVIS-SJHOIFEDSA-N
Data  1 KI
  Tab Delimited (TSV)   2D SDfile   Computed 3D by Vconf -m prep SDfile
Find this compound or compounds like it in BindingDB:
Activity Spreadsheet -- Enzyme Inhibition Constant Data from BindingDB
Found 1 hit for monomerid = 126177
TargetCalcitonin gene-related peptide 1(Homo sapiens (Human))
Merck Sharp & Dohme
US Patent
LigandPNGBDBM126177(US8778957, 88)
Affinity DataKi:  2.60nM ΔG°:  -11.7kcal/molepH: 7.4 T: 2°C. Assay description: Cells expressing recombinant human CL receptor/RAMP1 were washed with PBS and harvested in harvest buffer containing 50 mM HEPES, 1 mM EDTA and Compl...
In DepthDetails US Patent