BDBM12689 1-(3-amino-1,2-benzoxazol-5-yl)-6-(4-{2-[(diethylamino)methyl]phenyl}phenyl)-3-(trifluoromethyl)-1H,4H,5H,6H,7H-pyrazolo[3,4-c]pyridin-7-one::BMS-740808 Analogue 6b::bicyclic pyrazole scaffold
SMILES CCN(CC)Cc1ccccc1-c1ccc(cc1)N1CCc2c(nn(c2C1=O)-c1ccc2onc(N)c2c1)C(F)(F)F
InChI Key InChIKey=UKWUFMOOIOETEJ-UHFFFAOYSA-N
Data  1 KI
  Tab Delimited (TSV)   2D SDfile   Computed 3D by Vconf -m prep SDfile
Find this compound or compounds like it in BindingDB:
Activity Spreadsheet -- Enzyme Inhibition Constant Data from BindingDB
Found 1 hit for monomerid = 12689
TargetCoagulation factor X(Homo sapiens (Human))
Bristol-Myers Squibb Pharmaceutical Research Institute
LigandPNGBDBM12689(1-(3-amino-1,2-benzoxazol-5-yl)-6-(4-{2-[(diethyla...)
Affinity DataKi:  0.110nM ΔG°:  -13.4kcal/molepH: 7.0 T: 2°C. Assay description: Ki values were obtained from human purified enzyme. All assays were run in microtiter plates. Plates were read for 30 min at 405 nm. Rates were deter...
In DepthDetails ArticlePubMed