BDBM12748 2-{6-[4-(2-methanesulfonylphenyl)phenyl]-7-oxo-3-(trifluoromethyl)-1H,4H,5H,6H,7H-pyrazolo[3,4-c]pyridin-1-yl}-5-methoxybenzene-1-sulfonamide::dihydropyrazolopyridinone analogue 8e
SMILES COc1ccc(c(c1)S(N)(=O)=O)-n1nc(c2CCN(C(=O)c12)c1ccc(cc1)-c1ccccc1S(C)(=O)=O)C(F)(F)F
InChI Key InChIKey=XZGQFOLYJWIPPP-UHFFFAOYSA-N
Data  1 KI
  Tab Delimited (TSV)   2D SDfile   Computed 3D by Vconf -m prep SDfile
Find this compound or compounds like it in BindingDB:
Activity Spreadsheet -- Enzyme Inhibition Constant Data from BindingDB
Found 1 hit for monomerid = 12748
TargetCoagulation factor X(Homo sapiens (Human))
Bristol-Myers Squibb Pharmaceutical Research Institute
LigandPNGBDBM12748(2-{6-[4-(2-methanesulfonylphenyl)phenyl]-7-oxo-3-(...)
Affinity DataKi:  0.120nM ΔG°:  -13.4kcal/molepH: 7.0 T: 2°C. Assay description: Ki values were obtained from human purified enzyme. All assays were run in microtiter plates. Plates were read for 30 min at 405 nm. Rates were deter...
In DepthDetails ArticlePubMed