BDBM130657 US8822447, 166::US9771375, Example 166
SMILES CSc1nn(-c2ccccc2)c2cc(NCCC3CCNCC3)ccc12
InChI Key InChIKey=RGCVDOGZPSHUBJ-UHFFFAOYSA-N
Data  2 IC50
  Tab Delimited (TSV)   2D SDfile   Computed 3D by Vconf -m prep SDfile
Find this compound or compounds like it in BindingDB:
Activity Spreadsheet -- Enzyme Inhibition Constant Data from BindingDB
Found 2 hits for monomerid = 130657
TargetKetohexokinase(Homo sapiens (Human))
Janssen Pharmaceutica
US Patent
LigandPNGBDBM130657(US8822447, 166 | US9771375, Example 166)
Affinity DataIC50:  600nM. Assay description: An enzymatic assay was developed to measure KHK-mediated conversion of D-fructose to Fructose-1-P (F-1-P) using High Throughput Mass Spectroscopy (HT...
In DepthDetails US Patent
TargetKetohexokinase(Homo sapiens (Human))
Janssen Pharmaceutica
US Patent
LigandPNGBDBM130657(US8822447, 166 | US9771375, Example 166)
Affinity DataIC50:  600nMT: 2°C. Assay description: An enzymatic assay was developed to measure KHK-mediated conversion of D-fructose to Fructose-1-P (F-1-P) using High Throughput Mass Spectroscopy (HT...
In DepthDetails US Patent