BDBM1319 3-Aminopyridin-2(1H)-one analogue 39::5-ethyl-3-{[(5-fluoro-1,3-benzoxazol-2-yl)methyl]amino}-6-methyl-1,2-dihydropyridin-2-one
SMILES CCc1cc(NCc2nc3cc(F)ccc3o2)c(=O)[nH]c1C
InChI Key InChIKey=SOGQCRCDBFCYGD-UHFFFAOYSA-N
Data  1 IC50
  Tab Delimited (TSV)   2D SDfile   Computed 3D by Vconf -m prep SDfile
Find this compound or compounds like it in BindingDB:
Activity Spreadsheet -- Enzyme Inhibition Constant Data from BindingDB
Found 1 hit for monomerid = 1319
TargetGag-Pol polyprotein [588-1027]/[588-1147](Human immunodeficiency virus type 1)
Merck Research Laboratories
LigandPNGBDBM1319(3-Aminopyridin-2(1H)-one analogue 39 | 5-ethyl-3-{...)
Affinity DataIC50:  470nM. Assay description: The IC50 of reverse transcriptase is the concentration that inhibits 50% of recombinant HIV-1 RT RNA-directed DNA polymerase activity in vitro.
In DepthDetails ArticlePubMed