BDBM139050 US8883784, 11
SMILES CN(C)CCCNc1ccc(cc1S(=O)(=O)C(F)(F)F)S(=O)(=O)NC(=O)c1nc(sc1CCc1ccccc1)N1CCc2cccc(C(=O)Nc3nc4ccccc4s3)c2C1
InChI Key InChIKey=MHXHSNDCXSSBKU-UHFFFAOYSA-N
Data  1 KI
  Tab Delimited (TSV)   2D SDfile   Computed 3D by Vconf -m prep SDfile
Find this compound or compounds like it in BindingDB:
Activity Spreadsheet -- Enzyme Inhibition Constant Data from BindingDB
Found 1 hit for monomerid = 139050
TargetBcl-2-like protein 1(Homo sapiens (Human))
Abbvie
US Patent
LigandPNGBDBM139050(US8883784, 11)
Affinity DataKi:  0.0600nM ΔG°:  -13.9kcal/moleT: 2°C. Assay description: The measurement of competition of compounds of Formula (I) with F-Bak for a Bcl-2 family protein (Bcl-xL) binding site using a Time Resolved Fluoresc...
In DepthDetails US Patent