BDBM139214 US8889668, I70
SMILES Cc1cscc1-c1ccc(cc1C(F)(F)F)-c1nc(no1)-c1ccccc1OC(F)(F)F
InChI Key InChIKey=UYKVDPMHLWLVQD-UHFFFAOYSA-N
Data  1 KI
  Tab Delimited (TSV)   2D SDfile   Computed 3D by Vconf -m prep SDfile
Find this compound or compounds like it in BindingDB:
Activity Spreadsheet -- Enzyme Inhibition Constant Data from BindingDB
Found 1 hit for monomerid = 139214
TargetSphingosine 1-phosphate receptor 1(Homo sapiens (Human))
Merck Serono
US Patent
LigandPNGBDBM139214(US8889668, I70)
Affinity DataKi:  4nM ΔG°:  -10.6kcal/molepH: 7.4 T: 2°C. Assay description: Receptor binding assay: Membranes were prepared from CHO cells expressing S1P1 or S1P3 for use in ligand and 35S-GTPgammaS binding studies. Cells wer...
In DepthDetails US Patent